BDBM148363 US10017516, Compound 30::US9682983, 30
SMILES C1CN(CCN1)c1ccc(cn1)-c1cnc2c(cnn2c1)-c1cccc2ncccc12
InChI Key InChIKey=TVXUSVBFYFEVJT-UHFFFAOYSA-N
Data  8 IC50
  Tab Delimited (TSV)   2D SDfile   Computed 3D by Vconf -m prep SDfile
Find this compound or compounds like it in BindingDB:
Activity Spreadsheet -- Enzyme Inhibition Constant Data from BindingDB
Found 8 hits for monomerid = 148363
TargetSerine/threonine-protein kinase receptor R3(Homo sapiens (Human))
The Brigham And Women'S Hospital
US Patent
LigandPNGBDBM148363(US10017516, Compound 30 | US9682983, 30)
Affinity DataIC50:  254nMpH: 7.5Assay Description:Specifically, compounds were assayed using LANCE® Ultra ULight¿ technology (Perkin Elmer) against human ALK1-6 enzymes (ALK1: Life Technologies, ALK2...
Ligand InfoPC cidPC sid
In DepthDetails US Patent
TargetActivin receptor type-1(Homo sapiens (Human))
The Brigham And Women'S Hospital
US Patent
LigandPNGBDBM148363(US10017516, Compound 30 | US9682983, 30)
Affinity DataIC50:  84nMpH: 7.5Assay Description:Specifically, compounds were assayed using LANCE® Ultra ULight¿ technology (Perkin Elmer) against human ALK1-6 enzymes (ALK1: Life Technologies, ALK2...
Ligand InfoPC cidPC sid
In DepthDetails US Patent
TargetBone morphogenetic protein receptor type-1A(Homo sapiens (Human))
The Brigham And Women'S Hospital
US Patent
LigandPNGBDBM148363(US10017516, Compound 30 | US9682983, 30)
Affinity DataIC50:  4.14E+3nMpH: 7.5Assay Description:Specifically, compounds were assayed using LANCE® Ultra ULight¿ technology (Perkin Elmer) against human ALK1-6 enzymes (ALK1: Life Technologies, ALK2...
Ligand InfoPC cidPC sid
In DepthDetails US Patent
TargetBone morphogenetic protein receptor type-1B(Homo sapiens (Human))
The Brigham And Women'S Hospital
US Patent
LigandPNGBDBM148363(US10017516, Compound 30 | US9682983, 30)
Affinity DataIC50:  2.48E+3nM. Assay description: Compounds were assessed in ALK1-6 enzymatic assays. Specifically, compounds were assayed using LANCE® Ultra ULight technology (Perkin Elmer) against ...
Ligand InfoPC cidPC sid
In DepthDetails US Patent
TargetSerine/threonine-protein kinase receptor R3(Homo sapiens (Human))
The Brigham And Women'S Hospital
US Patent
LigandPNGBDBM148363(US10017516, Compound 30 | US9682983, 30)
Affinity DataIC50:  254nM. Assay description: Compounds were assessed in ALK1-6 enzymatic assays. Specifically, compounds were assayed using LANCE® Ultra ULight technology (Perkin Elmer) against ...
Ligand InfoPC cidPC sid
In DepthDetails US Patent
TargetActivin receptor type-1(Homo sapiens (Human))
The Brigham And Women'S Hospital
US Patent
LigandPNGBDBM148363(US10017516, Compound 30 | US9682983, 30)
Affinity DataIC50:  84nM. Assay description: Compounds were assessed in ALK1-6 enzymatic assays. Specifically, compounds were assayed using LANCE® Ultra ULight technology (Perkin Elmer) against ...
Ligand InfoPC cidPC sid
In DepthDetails US Patent
TargetBone morphogenetic protein receptor type-1A(Homo sapiens (Human))
The Brigham And Women'S Hospital
US Patent
LigandPNGBDBM148363(US10017516, Compound 30 | US9682983, 30)
Affinity DataIC50:  4.14E+3nM. Assay description: Compounds were assessed in ALK1-6 enzymatic assays. Specifically, compounds were assayed using LANCE® Ultra ULight technology (Perkin Elmer) against ...
Ligand InfoPC cidPC sid
In DepthDetails US Patent
TargetBone morphogenetic protein receptor type-1B(Homo sapiens (Human))
The Brigham And Women'S Hospital
US Patent
LigandPNGBDBM148363(US10017516, Compound 30 | US9682983, 30)
Affinity DataIC50:  2.48E+3nMpH: 7.5Assay Description:Specifically, compounds were assayed using LANCE® Ultra ULight¿ technology (Perkin Elmer) against human ALK1-6 enzymes (ALK1: Life Technologies, ALK2...
Ligand InfoPC cidPC sid
In DepthDetails US Patent