BDBM148373 US8962637, 98
SMILES Cc1ccc(NC(=O)c2cccc(c2)C(F)(F)F)cc1N1CCc2nc(Nc3ccc(cc3)C(=O)NCCO)ncc2C1
InChI Key InChIKey=FFPDTHQSUMBEBA-UHFFFAOYSA-N
Data  2 IC50
  Tab Delimited (TSV)   2D SDfile   Computed 3D by Vconf -m prep SDfile
Find this compound or compounds like it in BindingDB:
Activity Spreadsheet -- Enzyme Inhibition Constant Data from BindingDB
Found 2 hits for monomerid = 148373
TargetProto-oncogene tyrosine-protein kinase Src(Homo sapiens (Human))
Debiopharm
US Patent
LigandPNGBDBM148373(US8962637, 98)
Affinity DataIC50:  1nM. Assay description: Compounds were screened in the TR-FRET assay for JAK2 and c-Src kinase inhibition. Ultra light poly GT (Perkin Elmer) was used as the substrate for J...
In DepthDetails US Patent
TargetTyrosine-protein kinase JAK2(Homo sapiens (Human))
Debiopharm
US Patent
LigandPNGBDBM148373(US8962637, 98)
Affinity DataIC50:  7nM. Assay description: Compounds were screened in the TR-FRET assay for JAK2 and c-Src kinase inhibition. Ultra light poly GT (Perkin Elmer) was used as the substrate for J...
In DepthDetails US Patent