BDBM148384 US9682961, 30
SMILES Cc1cc2nc[nH]c2cc1Nc1ncc2cccc(O[C@@H]3CC[C@H](O)CC3)c2n1
InChI Key
Data  1 IC50
  Tab Delimited (TSV)   2D SDfile   Computed 3D by Vconf -m prep SDfile
Find this compound or compounds like it in BindingDB:
Activity Spreadsheet -- Enzyme Inhibition Constant Data from BindingDB
Found 1 hit for monomerid = 148384
TargetCatenin beta-1/Protein Wnt-3a(Homo sapiens (Human))
Carna Biosciences
US Patent
LigandPNGBDBM148384(US9682961, 30)
Affinity DataIC50:  650nM. Assay description: Using ONE-Glo Luciferase Assay System (Promega Corporation, No. E6110), the luciferase activity of the cells in the wells was measured by a microplat...
Ligand InfoPC cidPC sid
In DepthDetails US Patent