BDBM148389 US9682961, 35
SMILES O[C@H]1CC[C@H](CC1)Oc1cccc2cnc(Nc3ccc4ncccc4c3)nc12
InChI Key InChIKey=AYZPESFOJIRSKT-KDURUIRLSA-N
Data  1 IC50
  Tab Delimited (TSV)   2D SDfile   Computed 3D by Vconf -m prep SDfile
Find this compound or compounds like it in BindingDB:
Activity Spreadsheet -- Enzyme Inhibition Constant Data from BindingDB
Found 1 hit for monomerid = 148389
TargetCatenin beta-1/Protein Wnt-3a(Homo sapiens (Human))
Carna Biosciences
US Patent
LigandPNGBDBM148389(US9682961, 35)
Affinity DataIC50:  650nM. Assay description: Using ONE-Glo Luciferase Assay System (Promega Corporation, No. E6110), the luciferase activity of the cells in the wells was measured by a microplat...
Ligand InfoPC cidPC sid
In DepthDetails US Patent