BDBM14916 2-[3-(5-carbamimidoyl-1H-1,3-benzodiazol-2-yl)-4-hydroxy-5-[2-(methylsulfanyl)phenyl]phenyl]butanedioic acid::5-amidino benzimidazole analog 27
SMILES CSc1ccccc1-c1cc(cc(-c2nc3ccc(cc3[nH]2)C(N)=N)c1O)C(CC(O)=O)C(O)=O
InChI Key InChIKey=BPCDARTUXWTIPI-UHFFFAOYSA-N
Data  1 KI
  Tab Delimited (TSV)   2D SDfile   Computed 3D by Vconf -m prep SDfile
Find this compound or compounds like it in BindingDB:
Activity Spreadsheet -- Enzyme Inhibition Constant Data from BindingDB
Found 1 hit for monomerid = 14916
TargetCoagulation factor VII(Homo sapiens (Human))
Celera
LigandPNGBDBM14916(2-[3-(5-carbamimidoyl-1H-1,3-benzodiazol-2-yl)-4-h...)
Affinity DataKi:  64nM. Assay description: The enzyme reactions were initiated by the addition of substrate, and the color developed from the release of p-nitroanilide from each chromogenic su...
In DepthDetails ArticlePubMed