BDBM149360 US8962860, 3
SMILES Cc1ccc(O)c(c1)C1N(C(=O)NC1=O)c1ccc2[nH]cnc2c1
InChI Key
Data  1 KI  1 IC50
  Tab Delimited (TSV)   2D SDfile   Computed 3D by Vconf -m prep SDfile
Find this compound or compounds like it in BindingDB:
Activity Spreadsheet -- Enzyme Inhibition Constant Data from BindingDB
Found 1 hit for monomerid = 149360
TargetGlutaminyl-peptide cyclotransferase(Homo sapiens (Human))
Probiodrug
US Patent
LigandPNGBDBM149360(US8962860, 3)
Affinity DataKi:  48nM ΔG°:  -10.1kcal/mole IC50:  34.9nMT: 2°C. Assay description: This novel assay was used to determine the kinetic parameters for most of the QC substrates. QC activity was analyzed spectrophotometrically using a ...
In DepthDetails US Patent