BDBM149403 US10434101, Compound I-3::US11096942, Compound I-3::US8975249, I-3
SMILES COc1cc(ccc1Nc1ncc(Cl)c(Oc2cccc(NC(=O)C=C)c2)n1)N1CCN(CC1)C(=O)CO
InChI Key InChIKey=WIKQZNCZVKHLAP-UHFFFAOYSA-N
Data  6 IC50
  Tab Delimited (TSV)   2D SDfile   Computed 3D by Vconf -m prep SDfile
Find this compound or compounds like it in BindingDB:
Activity Spreadsheet -- Enzyme Inhibition Constant Data from BindingDB
Found 6 hits for monomerid = 149403
TargetEpidermal growth factor receptor(Homo sapiens (Human))
Celgene Avilomics Research
US Patent
LigandPNGBDBM149403(US10434101, Compound I-3 | US11096942, Compound I-...)
Affinity DataIC50:  5.5nMpH: 7.5Assay Description:Briefly, 10x stocks of EGFR-WT (PV3872) from Invitrogen and EGFR-T790M/L858R (40350) from BPS Bioscience, San Diego, Calif., 1.13xATP (AS001A) and ap...
In DepthDetails US Patent
TargetEpidermal growth factor receptor(Homo sapiens (Human))
Celgene Avilomics Research
US Patent
LigandPNGBDBM149403(US10434101, Compound I-3 | US11096942, Compound I-...)
Affinity DataIC50: <1nMpH: 7.5Assay Description:Briefly, 10x stocks of EGFR-WT (PV3872) from Invitrogen and EGFR-T790M/L858R (40350) from BPS Bioscience, San Diego, Calif., 1.13xATP (AS001A) and ap...
In DepthDetails US Patent
TargetEpidermal growth factor receptor [T790M,L858R](Homo sapiens (Human))
Celgene Car
US Patent
LigandPNGBDBM149403(US10434101, Compound I-3 | US11096942, Compound I-...)
Affinity DataIC50: <1nM. Assay description: Briefly, 10× stocks of EGFR-WT (PV3872) from Invitrogen and EGFR-T790M/L858R (40350) from BPS Bioscience, San Diego, Calif., 1.13×ATP (AS001A) and ap...
In DepthDetails US Patent
TargetEpidermal growth factor receptor [T790M,L858R](Homo sapiens (Human))
Celgene Car
US Patent
LigandPNGBDBM149403(US10434101, Compound I-3 | US11096942, Compound I-...)
Affinity DataIC50: <1nM. Assay description: Briefly, 10× stocks of EGFR-WT (PV3872) from Invitrogen and EGFR-T790M/L858R (40350) from BPS Bioscience, San Diego, Calif., 1.13×ATP (AS001A) and ap...
In DepthDetails US Patent
TargetEpidermal growth factor receptor(Homo sapiens (Human))
Celgene Avilomics Research
US Patent
LigandPNGBDBM149403(US10434101, Compound I-3 | US11096942, Compound I-...)
Affinity DataIC50:  5.5nM. Assay description: Briefly, 10× stocks of EGFR-WT (PV3872) from Invitrogen and EGFR-T790M/L858R (40350) from BPS Bioscience, San Diego, Calif., 1.13×ATP (AS001A) and ap...
In DepthDetails US Patent
TargetEpidermal growth factor receptor(Homo sapiens (Human))
Celgene Avilomics Research
US Patent
LigandPNGBDBM149403(US10434101, Compound I-3 | US11096942, Compound I-...)
Affinity DataIC50:  5.5nM. Assay description: Briefly, 10× stocks of EGFR-WT (PV3872) from Invitrogen and EGFR-T790M/L858R (40350) from BPS Bioscience, San Diego, Calif., 1.13×ATP (AS001A) and ap...
In DepthDetails US Patent