BDBM150066 US8975417, 126
SMILES CC(=O)Nc1cc(nn2c(C)nnc12)N1C(c2c(C)nn(C3CC3)c2C1=O)c1ccc(Cl)cc1
InChI Key InChIKey=RAOXCFFQLBCSMC-UHFFFAOYSA-N
Data  3 IC50
  Tab Delimited (TSV)   2D SDfile   Computed 3D by Vconf -m prep SDfile
Find this compound or compounds like it in BindingDB:
Activity Spreadsheet -- Enzyme Inhibition Constant Data from BindingDB
Found 3 hits for monomerid = 150066
TargetBromodomain-containing protein 3(Homo sapiens (Human))
Novartis
US Patent
LigandPNGBDBM150066(US8975417, 126)
Affinity DataIC50: >3.70E+4nMpH: 7.5 T: 2°C. Assay description: All assays were performed in 384-well microtiter plates. Each assay plate contained 8-point serial dilutions for 40 test compounds, plus 16 high- and...
In DepthDetails US Patent
TargetBromodomain-containing protein 4(Homo sapiens (Human))
Novartis
US Patent
LigandPNGBDBM150066(US8975417, 126)
Affinity DataIC50:  1.10E+3nMpH: 7.5 T: 2°C. Assay description: All assays were performed in 384-well microtiter plates. Each assay plate contained 8-point serial dilutions for 40 test compounds, plus 16 high- and...
In DepthDetails US Patent
TargetCREB-binding protein(Homo sapiens (Human))
Novartis
US Patent
LigandPNGBDBM150066(US8975417, 126)
Affinity DataIC50: >3.70E+4nMpH: 7.5 T: 2°C. Assay description: In order to assess bromodomain selectivity, we set up a binding assay using the bromodomain encoded by the CREBBP gene. Compounds were tested in the ...
In DepthDetails US Patent