BDBM150079 US8975417, 139
SMILES CN1CC(C1)n1nc2C(=O)N(C(c2c1C)c1ccc(Cl)cc1)c1cc(C)c(=O)n(C)c1
InChI Key InChIKey=NKRWXLLSKYGFGB-UHFFFAOYSA-N
Data  3 IC50
  Tab Delimited (TSV)   2D SDfile   Computed 3D by Vconf -m prep SDfile
Find this compound or compounds like it in BindingDB:
Activity Spreadsheet -- Enzyme Inhibition Constant Data from BindingDB
Found 3 hits for monomerid = 150079
TargetBromodomain-containing protein 3(Homo sapiens (Human))
Novartis
US Patent
LigandPNGBDBM150079(US8975417, 139)
Affinity DataIC50:  120nMpH: 7.5 T: 2°C. Assay description: All assays were performed in 384-well microtiter plates. Each assay plate contained 8-point serial dilutions for 40 test compounds, plus 16 high- and...
In DepthDetails US Patent
TargetBromodomain-containing protein 2(Homo sapiens (Human))
Novartis
US Patent
LigandPNGBDBM150079(US8975417, 139)
Affinity DataIC50:  160nMpH: 7.5 T: 2°C. Assay description: All assays were performed in 384-well microtiter plates. Each assay plate contained 8-point serial dilutions for 40 test compounds, plus 16 high- and...
In DepthDetails US Patent
TargetBromodomain-containing protein 4(Homo sapiens (Human))
Novartis
US Patent
LigandPNGBDBM150079(US8975417, 139)
Affinity DataIC50:  190nMpH: 7.5 T: 2°C. Assay description: All assays were performed in 384-well microtiter plates. Each assay plate contained 8-point serial dilutions for 40 test compounds, plus 16 high- and...
In DepthDetails US Patent