BDBM150119 US8975417, 187
SMILES COc1ccccc1-n1nc(C)c2C(N(C(=O)c12)c1cc(C)c2nnc(C)n2c1)c1ccc(Cl)cc1F
InChI Key InChIKey=RKZATRLAMOOMLN-UHFFFAOYSA-N
Data  3 IC50
  Tab Delimited (TSV)   2D SDfile   Computed 3D by Vconf -m prep SDfile
Find this compound or compounds like it in BindingDB:
Activity Spreadsheet -- Enzyme Inhibition Constant Data from BindingDB
Found 3 hits for monomerid = 150119
TargetBromodomain-containing protein 3(Homo sapiens (Human))
Novartis
US Patent
LigandPNGBDBM150119(US8975417, 187)
Affinity DataIC50:  42nMpH: 7.5 T: 2°C. Assay description: All assays were performed in 384-well microtiter plates. Each assay plate contained 8-point serial dilutions for 40 test compounds, plus 16 high- and...
In DepthDetails US Patent
TargetBromodomain-containing protein 4(Homo sapiens (Human))
Novartis
US Patent
LigandPNGBDBM150119(US8975417, 187)
Affinity DataIC50:  27nMpH: 7.5 T: 2°C. Assay description: All assays were performed in 384-well microtiter plates. Each assay plate contained 8-point serial dilutions for 40 test compounds, plus 16 high- and...
In DepthDetails US Patent
TargetCREB-binding protein(Homo sapiens (Human))
Novartis
US Patent
LigandPNGBDBM150119(US8975417, 187)
Affinity DataIC50:  3.30E+4nMpH: 7.5 T: 2°C. Assay description: In order to assess bromodomain selectivity, we set up a binding assay using the bromodomain encoded by the CREBBP gene. Compounds were tested in the ...
In DepthDetails US Patent