BDBM150691 US8987254, 6::US9999624, 7
SMILES NC1=N[C@]2(CN(C[C@H]2CS1)c1ncc(F)cn1)c1cccc(NC(=O)c2ncc(F)cc2F)c1
InChI Key InChIKey=KEPOOTXKSNZTNN-WHEQGISXSA-N
Data  2 IC50
  Tab Delimited (TSV)   2D SDfile   Computed 3D by Vconf -m prep SDfile
Find this compound or compounds like it in BindingDB:
Activity Spreadsheet -- Enzyme Inhibition Constant Data from BindingDB
Found 2 hits for monomerid = 150691
TargetBeta-secretase 1(Homo sapiens (Human))
Eli Lilly
US Patent
LigandPNGBDBM150691(US8987254, 6 | US9999624, 7)
Affinity DataIC50:  0.739nM. Assay description: Serial dilutions of test compounds are prepared as described above. Compounds are further diluted 20× in KH2PO4 buffer. Ten μL of each dilution ...
In DepthDetails US Patent
TargetBeta-secretase 1(Homo sapiens (Human))
Eli Lilly
US Patent
LigandPNGBDBM150691(US8987254, 6 | US9999624, 7)
Affinity DataIC50:  0.739nMpH: 4.6 T: 2°C. Assay description: Serial dilutions of test compounds are prepared as described above. Compounds are further diluted 20x in KH2PO4 buffer. Ten uL of each dilution is ad...
In DepthDetails US Patent