BDBM150758 2-(2-Hydroxyphenyl)-4H-chromen-4-one (3d)::US9271961, 2'-Hydroxyflavone
SMILES Oc1ccccc1-c1cc(=O)c2ccccc2o1
InChI Key InChIKey=ZZLQHXCRRMUGQJ-UHFFFAOYSA-N
Data  2 KI  5 IC50
  Tab Delimited (TSV)   2D SDfile   Computed 3D by Vconf -m prep SDfile
Find this compound or compounds like it in BindingDB:
Activity Spreadsheet -- Enzyme Inhibition Constant Data from BindingDB
Found 7 hits for monomerid = 150758
TargetAmine oxidase [flavin-containing] A(Homo sapiens (Human))
Birla Institute Of Technology
LigandPNGBDBM150758(2-(2-Hydroxyphenyl)-4H-chromen-4-one (3d) | US9271...)
Affinity DataKi:  520nM. Assay description: The activities of recombinant hMAO-A and hMAO-B were determined using p-tyramine as common substrate and calculated as 0.18 +/- 0.01 nmol/mg/min (n =...
In DepthDetails ArticlePubMed
TargetAmine oxidase [flavin-containing] B(Homo sapiens (Human))
Birla Institute Of Technology
LigandPNGBDBM150758(2-(2-Hydroxyphenyl)-4H-chromen-4-one (3d) | US9271...)
Affinity DataKi:  5.98E+3nM. Assay description: The activities of recombinant hMAO-A and hMAO-B were determined using p-tyramine as common substrate and calculated as 0.18 +/- 0.01 nmol/mg/min (n =...
In DepthDetails ArticlePubMed
TargetAldo-keto reductase family 1 member C1(Homo sapiens (Human))
University Of Pennsylvania
US Patent
LigandPNGBDBM150758(2-(2-Hydroxyphenyl)-4H-chromen-4-one (3d) | US9271...)
Affinity DataIC50:  6.20E+3nM. Assay description: Compounds may be evaluated as selective reversible inhibitors of AKR1C3 by screening them against homogeneous recombinant AKR1C1-AKR1C4 expressed in ...
In DepthDetails US Patent
TargetAndrogen receptor(Homo sapiens (Human))
Kanazawa University
Curated by ChEMBL
LigandPNGBDBM150758(2-(2-Hydroxyphenyl)-4H-chromen-4-one (3d) | US9271...)
Affinity DataIC50: >1.00E+4nM. Assay description: Antagonist activity at AR in human LNCAP cells assessed as reduction in DHT-induced cell growth treated for every 2 days for 4 days by hemocytometry
In DepthDetails ArticlePubMed
TargetAndrogen receptor(Homo sapiens (Human))
Kanazawa University
Curated by ChEMBL
LigandPNGBDBM150758(2-(2-Hydroxyphenyl)-4H-chromen-4-one (3d) | US9271...)
Affinity DataIC50: <1.00E+3nM. Assay description: Antagonist activity at AR in human LNCAP cells assessed as reduction in DHT-induced transcriptional activation after 24 hrs by luciferase reporter ge...
In DepthDetails ArticlePubMed
TargetAldo-keto reductase family 1 member C3(Homo sapiens (Human))
University Of Pennsylvania
US Patent
LigandPNGBDBM150758(2-(2-Hydroxyphenyl)-4H-chromen-4-one (3d) | US9271...)
Affinity DataIC50:  300nM. Assay description: Compounds may be evaluated as selective reversible inhibitors of AKR1C3 by screening them against homogeneous recombinant AKR1C1-AKR1C4 expressed in ...
In DepthDetails US Patent
TargetAldo-keto reductase family 1 member C2(Homo sapiens (Human))
University Of Pennsylvania
US Patent
LigandPNGBDBM150758(2-(2-Hydroxyphenyl)-4H-chromen-4-one (3d) | US9271...)
Affinity DataIC50:  4.71E+4nM. Assay description: Compounds may be evaluated as selective reversible inhibitors of AKR1C3 by screening them against homogeneous recombinant AKR1C1-AKR1C4 expressed in ...
In DepthDetails US Patent