BDBM150764 2-(Naphthalen-2-yl)-4H-chromen-4-one (3p)
SMILES O=c1cc(oc2ccccc12)-c1ccc2ccccc2c1
InChI Key InChIKey=DRVNPFLQCWPSID-UHFFFAOYSA-N
Data  2 KI
  Tab Delimited (TSV)   2D SDfile   Computed 3D by Vconf -m prep SDfile
Find this compound or compounds like it in BindingDB:
Activity Spreadsheet -- Enzyme Inhibition Constant Data from BindingDB
Found 2 hits for monomerid = 150764
TargetAmine oxidase [flavin-containing] B(Homo sapiens (Human))
Birla Institute Of Technology
LigandPNGBDBM150764(2-(Naphthalen-2-yl)-4H-chromen-4-one (3p))
Affinity DataKi:  1.30E+3nM. Assay description: The activities of recombinant hMAO-A and hMAO-B were determined using p-tyramine as common substrate and calculated as 0.18 +/- 0.01 nmol/mg/min (n =...
In DepthDetails ArticlePubMed
TargetAmine oxidase [flavin-containing] A(Homo sapiens (Human))
Birla Institute Of Technology
LigandPNGBDBM150764(2-(Naphthalen-2-yl)-4H-chromen-4-one (3p))
Affinity DataKi:  2.55E+3nM. Assay description: The activities of recombinant hMAO-A and hMAO-B were determined using p-tyramine as common substrate and calculated as 0.18 +/- 0.01 nmol/mg/min (n =...
In DepthDetails ArticlePubMed