BDBM150792 N-methyl-N¿-undecyl urea (7)
SMILES CCCCCCCCCCCNC(=O)NC
InChI Key InChIKey=CZQYCRHFDSHZRQ-UHFFFAOYSA-N
Data  1 IC50
  Tab Delimited (TSV)   2D SDfile   Computed 3D by Vconf -m prep SDfile
Find this compound or compounds like it in BindingDB:
Activity Spreadsheet -- Enzyme Inhibition Constant Data from BindingDB
Found 1 hit for monomerid = 150792
TargetJuvenile hormone epoxide hydrolase(Manduca sexta (Tobacco hornworm))
Goethe Universität Frankfurt
LigandPNGBDBM150792(N-methyl-N¿-undecyl urea (7))
Affinity DataIC50:  4.30E+3nM. Assay description: We used quantitative reverse-transcriptase PCR to measure the RNA levels of certain AMP genes (lysozyme, gallerimycin, moricin and cecropin) in cater...
In DepthDetails ArticlePubMed