BDBM15126 5-isoquinolinyl pyridine 10e::6-{5-[(2S)-2-amino-3-(quinolin-3-yl)propoxy]pyridin-3-yl}isoquinoline
SMILES N[C@H](COc1cncc(c1)-c1ccc2cnccc2c1)Cc1cnc2ccccc2c1
InChI Key InChIKey=XUWKMEBHOZHGMG-DEOSSOPVSA-N
Data  1 KI
  Tab Delimited (TSV)   2D SDfile   Computed 3D by Vconf -m prep SDfile
Find this compound or compounds like it in BindingDB:
Activity Spreadsheet -- Enzyme Inhibition Constant Data from BindingDB
Found 1 hit for monomerid = 15126
LigandPNGBDBM15126(5-isoquinolinyl pyridine 10e | 6-{5-[(2S)-2-amino-...)
Affinity DataKi:  85nM ΔG°:  -9.54kcal/molepH: 7.5 T: 2°C. Assay description: The kinase assay uses His-Akt1 and a biotinylated peptide as substrate. The biotinylated peptides were immobilized on streptavidin-coated FLASH plat...
In DepthDetails ArticlePubMed