BDBM151480 US8987314, B291
SMILES COCCN(C)C(=O)c1ccc(cc1)-c1ccc2nc(sc2c1)C(C(=O)NCCS(N)(=O)=O)S(=O)(=O)CC1CC1
InChI Key InChIKey=PURXZWXTAOPXSC-UHFFFAOYSA-N
Data  2 IC50
  Tab Delimited (TSV)   2D SDfile   Computed 3D by Vconf -m prep SDfile
Find this compound or compounds like it in BindingDB:
Activity Spreadsheet -- Enzyme Inhibition Constant Data from BindingDB
Found 2 hits for monomerid = 151480
TargetHepatic triacylglycerol lipase(Homo sapiens (Human))
Bristol-Myers Squibb
US Patent
LigandPNGBDBM151480(US8987314, B291)
Affinity DataIC50:  35.2nMpH: 8.0 T: 2°C. Assay description: Endothelial lipase (EL) and hepatic lipase (HL) activities were measured using a fluorescent substrate, A10070, (Invitrogen, CA) doped into an artifi...
In DepthDetails US Patent
TargetEndothelial lipase(Homo sapiens (Human))
Bristol-Myers Squibb
US Patent
LigandPNGBDBM151480(US8987314, B291)
Affinity DataIC50:  0.700nMpH: 8.0 T: 2°C. Assay description: Endothelial lipase (EL) and hepatic lipase (HL) activities were measured using a fluorescent substrate, A10070, (Invitrogen, CA) doped into an artifi...
In DepthDetails US Patent