BDBM151620 US8987335, 21
SMILES CC\C(=N/NC(=O)c1cccc(c1)S(=O)(=O)N1CCOCC1)c1cc(Cl)ccc1O
InChI Key InChIKey=OPNNGPMDAVGREY-RELWKKBWSA-N
Data  2 IC50
  Tab Delimited (TSV)   2D SDfile   Computed 3D by Vconf -m prep SDfile
Find this compound or compounds like it in BindingDB:
Activity Spreadsheet -- Enzyme Inhibition Constant Data from BindingDB
Found 2 hits for monomerid = 151620
TargetLysine-specific histone demethylase 1A(Homo sapiens (Human))
University Of Utah Research Foundation
US Patent
LigandPNGBDBM151620(US8987335, 21)
Affinity DataIC50: >3.00E+3nM. Assay description: The primary assay for compound inhibitory activity was the LSD1 Inhibitor Screening Assay Kit (Cayman Chemical Company, Ann Arbor, Mich.; Cayman Chem...
In DepthDetails US Patent
TargetLysine-specific histone demethylase 1A(Homo sapiens (Human))
University Of Utah Research Foundation
US Patent
LigandPNGBDBM151620(US8987335, 21)
Affinity DataIC50: >3.00E+3nM. Assay description: The primary assay for compound inhibitory activity was the LSD1 Inhibitor Screening Assay Kit (Cayman Chemical Company, Ann Arbor, Mich.; Cayman Chem...
In DepthDetails US Patent