BDBM151948 US8987457, 142
SMILES CO[C@@H]1[C@@H](C)C[C@H](C[C@H]1N)c1ccncc1NC(=O)c1ccc(F)c(n1)-c1c(F)cc(OC(C)C)cc1F
InChI Key InChIKey=FKRJLOFLENGVAA-GZDINDOJSA-N
Data  3 IC50
  Tab Delimited (TSV)   2D SDfile   Computed 3D by Vconf -m prep SDfile
Find this compound or compounds like it in BindingDB:
Activity Spreadsheet -- Enzyme Inhibition Constant Data from BindingDB
Found 3 hits for monomerid = 151948
TargetSerine/threonine-protein kinase pim-3(Homo sapiens (Human))
Novartis
US Patent
LigandPNGBDBM151948(US8987457, 142)
Affinity DataIC50:  0.870nM. Assay description: Pim 1, Pim 2 & Pim 3 AlphaScreen assays using high ATP (11-125.times. ATP Km) were used to determine the biochemical activity of the inhibitors. The ...
In DepthDetails US Patent
TargetSerine/threonine-protein kinase pim-2(Homo sapiens (Human))
Novartis
US Patent
LigandPNGBDBM151948(US8987457, 142)
Affinity DataIC50:  0.790nM. Assay description: Pim 1, Pim 2 & Pim 3 AlphaScreen assays using high ATP (11-125.times. ATP Km) were used to determine the biochemical activity of the inhibitors. The ...
In DepthDetails US Patent
TargetSerine/threonine-protein kinase pim-1(Homo sapiens (Human))
Novartis
US Patent
LigandPNGBDBM151948(US8987457, 142)
Affinity DataIC50:  0.0200nM. Assay description: Pim 1, Pim 2 & Pim 3 AlphaScreen assays using high ATP (11-125.times. ATP Km) were used to determine the biochemical activity of the inhibitors. The ...
In DepthDetails US Patent