BDBM15219 Isoquinoline-5-sulfonic acid (2R*,5S*)-(5-(4-chlorobenzyloxymethyl)pyrrolidin-2-yl-methyl)amide::N-{[(2R,5S)-5-{[(4-chlorophenyl)methoxy]methyl}pyrrolidin-2-yl]methyl}isoquinoline-5-sulfonamide::isoquinoline-5-sulfonamide 55
SMILES Clc1ccc(COC[C@@H]2CC[C@H](CNS(=O)(=O)c3cccc4cnccc34)N2)cc1
InChI Key InChIKey=QWIMKAGDMPBCKN-UXHICEINSA-N
Data  1 IC50
  Tab Delimited (TSV)   2D SDfile   Computed 3D by Vconf -m prep SDfile
Find this compound or compounds like it in BindingDB:
Activity Spreadsheet -- Enzyme Inhibition Constant Data from BindingDB
Found 1 hit for monomerid = 15219
TargetRAC-beta serine/threonine-protein kinase(Homo sapiens (Human))
Uk Centre For Cancer Therapeutics
LigandPNGBDBM15219(Isoquinoline-5-sulfonic acid (2R*,5S*)-(5-(4-chlor...)
Affinity DataIC50:  1.70E+3nM. Assay description: The purified PKB beta enzyme was assayed with a peptide substrate and test compound in the presence of 30 uM ATP/ [gamma-33P]ATP in 96-well plates. I...
In DepthDetails ArticlePubMed