BDBM152253 US8993552, 36
SMILES O=C1CC(CC2=C1C(Nc1ccccc1N2)c1cccnc1)c1ccc2OCOc2c1
InChI Key InChIKey=FYFUQHWHGLQJHZ-UHFFFAOYSA-N
Data  1 IC50
  Tab Delimited (TSV)   2D SDfile   Computed 3D by Vconf -m prep SDfile
Find this compound or compounds like it in BindingDB:
Activity Spreadsheet -- Enzyme Inhibition Constant Data from BindingDB
Found 1 hit for monomerid = 152253
TargetMenin(Homo sapiens (Human))
University Of Michigan
US Patent
LigandPNGBDBM152253(US8993552, 36)
Affinity DataIC50:  6.30E+4nM. Assay description: Assays effective in monitoring the inhibition of the MLL binding to menin were developed during experiments performed during the development of embod...
In DepthDetails US Patent