BDBM152255 US8993552, 38
SMILES COc1ccc(cc1OC)C1CC(=O)C2=C(C1)Nc1ccccc1NC2c1ccccc1C
InChI Key InChIKey=BXJTUGWLCUHXTK-UHFFFAOYSA-N
Data  1 IC50
  Tab Delimited (TSV)   2D SDfile   Computed 3D by Vconf -m prep SDfile
Find this compound or compounds like it in BindingDB:
Activity Spreadsheet -- Enzyme Inhibition Constant Data from BindingDB
Found 1 hit for monomerid = 152255
TargetMenin(Homo sapiens (Human))
University Of Michigan
US Patent
LigandPNGBDBM152255(US8993552, 38)
Affinity DataIC50:  1.15E+5nM. Assay description: Assays effective in monitoring the inhibition of the MLL binding to menin were developed during experiments performed during the development of embod...
In DepthDetails US Patent