BDBM152261 US8993552, 4H8 Compound 42
SMILES Nc1cccc(c1)-c1cccnc1
InChI Key InChIKey=YTJQJGKMRLQBJP-UHFFFAOYSA-N
Data  4 IC50
PDB links: 2 PDB IDs match this monomer.
  Tab Delimited (TSV)   2D SDfile   Computed 3D by Vconf -m prep SDfile
Find this compound or compounds like it in BindingDB:
Activity Spreadsheet -- Enzyme Inhibition Constant Data from BindingDB
Found 4 hits for monomerid = 152261
TargetMenin(Homo sapiens (Human))
University Of Michigan
US Patent
LigandPNGBDBM152261(US8993552, 4H8 Compound 42)
Affinity DataIC50:  5.00E+4nM. Assay description: Assays effective in monitoring the inhibition of the MLL binding to menin were developed during experiments performed during the development of embod...
In DepthDetails US Patent
TargetTyrosine-protein kinase receptor UFO(Homo sapiens (Human))
Experimental Drug Development Centre
Curated by ChEMBL
LigandPNGBDBM152261(US8993552, 4H8 Compound 42)
Affinity DataIC50:  3.63E+5nM. Assay description: Inhibition of Axl (unknown origin) using 5'FAM labeled KKKKEEIYFFF-NH2 peptide as substrate incubated for 1.5 hrs
In DepthDetails ArticlePubMed
TargetMAP kinase-interacting serine/threonine-protein kinase 1(Homo sapiens (Human))
A*Star
Curated by ChEMBL
LigandPNGBDBM152261(US8993552, 4H8 Compound 42)
Affinity DataIC50:  1.40E+4nM. Assay description: Inhibition of N-terminal GST-tagged MNK1 (unknown origin) (37 to 341 residues) expressed in Escherichia coli BL21 (DE3) cells using 5-FAM-TATKSGSTTKN...
In DepthDetails ArticlePubMed
TargetMAP kinase-interacting serine/threonine-protein kinase 2(Homo sapiens (Human))
A*Star
Curated by ChEMBL
LigandPNGBDBM152261(US8993552, 4H8 Compound 42)
Affinity DataIC50:  1.70E+4nM. Assay description: Inhibition of N-terminal GST-tagged MNK2 (unknown origin) (72 to 385 residues) expressed in Escherichia coli BL21 (DE3) cells using 5-FAM-TATKSGSTTKN...
In DepthDetails ArticlePubMed