BDBM152430 (E)-3,4-Dihydroxy-5-methoxybenzaldehyde O-methyl oxime (18)
SMILES CO\N=C\c1cc(O)c(O)c(OC)c1
InChI Key InChIKey=LCCLCCHMNBAIDU-BJMVGYQFSA-N
Data  1 KI
  Tab Delimited (TSV)   2D SDfile   Computed 3D by Vconf -m prep SDfile
Find this compound or compounds like it in BindingDB:
Activity Spreadsheet -- Enzyme Inhibition Constant Data from BindingDB
Found 1 hit for monomerid = 152430
Target1-deoxy-D-xylulose 5-phosphate reductoisomerase(Escherichia coli)
The Johns Hopkins University School Of Medicine
LigandPNGBDBM152430((E)-3,4-Dihydroxy-5-methoxybenzaldehyde O-methyl o...)
Affinity DataKi: >2.00E+5nMpH: 8.0Assay Description:DXP synthase reaction mixtures containing HEPES (100 mM, pH 8.0), MgCl2 (2 mM), NaCl (5 mM), ThDP (1 mM), BSA (1 mg/mL), pyruvate (12.5-250 µM), D-GA...
In DepthDetails ArticlePubMed