BDBM152493 5-(4'-Bromophenyl)-1,3,4-oxadiazole-2(3H)-thione (12)
SMILES Brc1ccc(cc1)-c1n[nH]c(=S)o1
InChI Key InChIKey=IAUFUSRGSRXPQY-UHFFFAOYSA-N
Data  1 IC50
  Tab Delimited (TSV)   2D SDfile   Computed 3D by Vconf -m prep SDfile
Find this compound or compounds like it in BindingDB:
Activity Spreadsheet -- Enzyme Inhibition Constant Data from BindingDB
Found 1 hit for monomerid = 152493
TargetThymidine phosphorylase(Escherichia coli (Enterobacteria))
Comsats Institute Of Information Technology
LigandPNGBDBM152493(5-(4'-Bromophenyl)-1,3,4-oxadiazole-2(3H)-thio...)
Affinity DataIC50:  6.40E+4nMpH: 7.4Assay Description:Briefly, a total reaction mixture of 200 µl contained 145 µl of potassium phosphate buffer (pH 7.4), 30 µl of enzyme at concentration 0.05 and 0.002 ...
In DepthDetails ArticlePubMed