BDBM152593 2-(1-(Benzofuran-2-yl)ethylidene)-N-(2-fluorophenyl)hydrazinecarbothioamide (3g)
SMILES CC(=NNC(=S)Nc1ccccc1F)c1cc2ccccc2o1
InChI Key InChIKey=PGBPNHVHZBAAGQ-RGVLZGJSSA-N
Data  1 IC50
  Tab Delimited (TSV)   2D SDfile   Computed 3D by Vconf -m prep SDfile
Find this compound or compounds like it in BindingDB:
Activity Spreadsheet -- Enzyme Inhibition Constant Data from BindingDB
Found 1 hit for monomerid = 152593
TargetUrease [D459Y,K653P](Canavalia ensiformis (Jack bean))
University Of Karachi
LigandPNGBDBM152593(2-(1-(Benzofuran-2-yl)ethylidene)-N-(2-fluoropheny...)
Affinity DataIC50:  321nMpH: 8.2Assay Description:The mixture of this enzyme inhibition assay was composed of 10 µL of enzyme (5 U/mL) and 10 µL of each test compound in the series (3a-3s) in 40 µL b...
In DepthDetails ArticlePubMed