BDBM152599 2-(1-(Benzofuran-2-yl)ethylidene)-N-(4-methoxyphenyl)hydrazinecarbothioamide (3m)
SMILES COc1ccc(NC(=S)NN=C(C)c2cc3ccccc3o2)cc1
InChI Key InChIKey=RZNCTENUOIMSLZ-UDWIEESQSA-N
Data  1 IC50
  Tab Delimited (TSV)   2D SDfile   Computed 3D by Vconf -m prep SDfile
Find this compound or compounds like it in BindingDB:
Activity Spreadsheet -- Enzyme Inhibition Constant Data from BindingDB
Found 1 hit for monomerid = 152599
TargetUrease [D459Y,K653P](Canavalia ensiformis (Jack bean))
University Of Karachi
LigandPNGBDBM152599(2-(1-(Benzofuran-2-yl)ethylidene)-N-(4-methoxyphen...)
Affinity DataIC50:  2.61E+3nMpH: 8.2Assay Description:The mixture of this enzyme inhibition assay was composed of 10 µL of enzyme (5 U/mL) and 10 µL of each test compound in the series (3a-3s) in 40 µL b...
In DepthDetails ArticlePubMed