BDBM152622 (E)-5-((2-(4-(4-Chlorophenyl)thiazole-2-yl)hydrazono)-methyl)-2-methoxy-phenol (11)
SMILES COc1ccc(\C=N\Nc2nc(cs2)-c2ccc(Cl)cc2)cc1O
InChI Key InChIKey=CXTJZGWTNOBTMF-DJKKODMXSA-N
Data  1 IC50
  Tab Delimited (TSV)   2D SDfile   Computed 3D by Vconf -m prep SDfile
Find this compound or compounds like it in BindingDB:
Activity Spreadsheet -- Enzyme Inhibition Constant Data from BindingDB
Found 1 hit for monomerid = 152622
TargetOligo-1,6-glucosidase IMA1(Saccharomyces cerevisiae S288c (Baker's yeast))
Hazara University
LigandPNGBDBM152622((E)-5-((2-(4-(4-Chlorophenyl)thiazole-2-yl)hydrazo...)
Affinity DataIC50:  1.76E+5nMpH: 6.8Assay Description:Total volume of 100 µL reaction mixture contained 70 µL 50 mM phosphate buffer pH 6.8, 10 µL test compound (0.5 mM in methanol) followed by the addit...
In DepthDetails ArticlePubMed