BDBM152625 (E)-4-((2-(4-(4-Methoxyphenyl)thiazol-2-yl)hydrazono)-methyl)-N,N-dimethylaniline (14)
SMILES COc1ccc(cc1)-c1csc(N\N=C\c2ccc(cc2)N(C)C)n1
InChI Key InChIKey=FDVKPSBQABTVHR-UDWIEESQSA-N
Data  1 IC50
  Tab Delimited (TSV)   2D SDfile   Computed 3D by Vconf -m prep SDfile
Find this compound or compounds like it in BindingDB:
Activity Spreadsheet -- Enzyme Inhibition Constant Data from BindingDB
Found 1 hit for monomerid = 152625
TargetOligo-1,6-glucosidase IMA1(Saccharomyces cerevisiae S288c (Baker's yeast))
Hazara University
LigandPNGBDBM152625((E)-4-((2-(4-(4-Methoxyphenyl)thiazol-2-yl)hydrazo...)
Affinity DataIC50:  1.46E+5nMpH: 6.8Assay Description:Total volume of 100 µL reaction mixture contained 70 µL 50 mM phosphate buffer pH 6.8, 10 µL test compound (0.5 mM in methanol) followed by the addit...
In DepthDetails ArticlePubMed