BDBM152841 US8993586, 19
SMILES CC(C)n1ncc2CC3(CCN(CC3)C(=O)C3=CC4C=NNC4N=C3)NC(=O)c12
InChI Key InChIKey=XPBFKHLWNBYPAN-UHFFFAOYSA-N
Data  2 IC50
  Tab Delimited (TSV)   2D SDfile   Computed 3D by Vconf -m prep SDfile
Find this compound or compounds like it in BindingDB:
Activity Spreadsheet -- Enzyme Inhibition Constant Data from BindingDB
Found 2 hits for monomerid = 152841
TargetAcetyl-CoA carboxylase 2(Homo sapiens (Human))
Pfizer
US Patent
LigandPNGBDBM152841(US8993586, 19)
Affinity DataIC50:  2.01E+3nM. Assay description: Preparation of rhACC2. Human ACC2 inhibition was measured using purified recombinant human ACC2 (hrACC2). Briefly, a full length Cytomax clone of ACC...
In DepthDetails US Patent
TargetAcetyl-CoA carboxylase 1(Homo sapiens (Human))
Pfizer
US Patent
LigandPNGBDBM152841(US8993586, 19)
Affinity DataIC50:  1.48E+3nMpH: 7.5Assay Description:Preparation of rhACC1. Two liters of SF9 cells, infected with recombinant baculovirus containing full length human ACC1 cDNA, were suspended in ice-c...
In DepthDetails US Patent