BDBM15326 3-[(2-{[4-(4,4-dimethyl-5-oxo-4,5-dihydro-1H-pyrazol-3-yl)-3-fluorophenyl]amino}-6-oxocyclohex-1-en-1-yl)methyl]benzonitrile::Aryldimethylpyrazolone 18e
SMILES CC1(C)C(=O)NN=C1c1ccc(NC2=C(Cc3cccc(c3)C#N)C(=O)CCC2)cc1F
InChI Key InChIKey=WNUOOVYVQLAOGQ-UHFFFAOYSA-N
Data  2 IC50
  Tab Delimited (TSV)   2D SDfile   Computed 3D by Vconf -m prep SDfile
Find this compound or compounds like it in BindingDB:
Activity Spreadsheet -- Enzyme Inhibition Constant Data from BindingDB
Found 2 hits for monomerid = 15326
TargetcGMP-inhibited 3',5'-cyclic phosphodiesterase 3A [388-1112](Homo sapiens (Human))
Merck Research Laboratories
LigandPNGBDBM15326(3-[(2-{[4-(4,4-dimethyl-5-oxo-4,5-dihydro-1H-pyraz...)
Affinity DataIC50:  69nM. Assay description: PDE activity was monitored by measuring the hydrolysis of [3H]-cAMP to [3H]-AMP using scintillation proximity assay (SPA). [3H]-AMP was captured by t...
In DepthDetails ArticlePubMed
TargetcGMP-inhibited 3',5'-cyclic phosphodiesterase 3B [387-1112](Homo sapiens (Human))
Merck Research Laboratories
LigandPNGBDBM15326(3-[(2-{[4-(4,4-dimethyl-5-oxo-4,5-dihydro-1H-pyraz...)
Affinity DataIC50:  3.20nM. Assay description: PDE activity was monitored by measuring the hydrolysis of [3H]-cAMP to [3H]-AMP using scintillation proximity assay (SPA). [3H]-AMP was captured by t...
In DepthDetails ArticlePubMed