BDBM153325 BPH-1158
SMILES CCCCCCCCOc1cccc(COc2ccc(cc2C(O)=O)S(=O)(=O)N2CCOCC2)c1
InChI Key InChIKey=CMGIINZLEYERNR-UHFFFAOYSA-N
Data  2 IC50
PDB links: 1 PDB ID matches this monomer.
  Tab Delimited (TSV)   2D SDfile   Computed 3D by Vconf -m prep SDfile
Find this compound or compounds like it in BindingDB:
Activity Spreadsheet -- Enzyme Inhibition Constant Data from BindingDB
Found 2 hits for monomerid = 153325
TargetDecaprenyl diphosphate synthase(Mycobacterium tuberculosis H37Rv)
University Of California San Diego
LigandPNGBDBM153325(BPH-1158)
Affinity DataIC50:  8.30E+4nMpH: 7.5Assay Description:We screened an in-house library of 19 compounds using cis-FPP as substrate. Briefly, the condensation of IPP and GPP, FPP, or cis-FPP catalyzed by DP...
Ligand InfoPC cidPC sidPDB
In DepthDetails ArticlePubMed
TargetDecaprenyl diphosphate synthase(Mycobacterium tuberculosis H37Rv)
University Of California San Diego
LigandPNGBDBM153325(BPH-1158)
Affinity DataIC50:  1.40E+3nMpH: 7.5Assay Description:We screened an in-house library of 43 compounds using GPP as substrate. Briefly, the condensation of IPP and GPP, FPP, or cis-FPP catalyzed by DPPS w...
Ligand InfoPC cidPC sidPDB
In DepthDetails ArticlePubMed