BDBM153368 BPH-294
SMILES OC(Cc1cccc(c1)-c1ccccc1)(P(=O)(O[Na])O[Na])P(=O)(O[Na])O[Na]
InChI Key InChIKey=COUBYAXCMSPZKL-UHFFFAOYSA-J
Data  1 IC50
  Tab Delimited (TSV)   2D SDfile   Computed 3D by Vconf -m prep SDfile
Find this compound or compounds like it in BindingDB:
Activity Spreadsheet -- Enzyme Inhibition Constant Data from BindingDB
Found 1 hit for monomerid = 153368
TargetDecaprenyl diphosphate synthase(Mycobacterium tuberculosis H37Rv)
University Of California San Diego
LigandPNGBDBM153368(BPH-294)
Affinity DataIC50:  7.50E+3nMpH: 7.5Assay Description:We screened an in-house library of 53 compounds using trans-FPP as substrate. Briefly, the condensation of IPP and GPP, FPP, or cis-FPP catalyzed by ...
In DepthDetails ArticlePubMed