BDBM153440 US8993808, 38
SMILES C(N[C@H]1CC1c1ccccc1)C1C=Nc2ccccc12
InChI Key InChIKey=OPYHBYZPIGUUJT-PVARCSIZSA-N
Data  3 IC50
  Tab Delimited (TSV)   2D SDfile   Computed 3D by Vconf -m prep SDfile
Find this compound or compounds like it in BindingDB:
Activity Spreadsheet -- Enzyme Inhibition Constant Data from BindingDB
Found 3 hits for monomerid = 153440
TargetAmine oxidase [flavin-containing] A(Homo sapiens (Human))
Oryzon Genomics
US Patent
LigandPNGBDBM153440(US8993808, 38)
Affinity DataIC50:  8.50E+3nMpH: 7.5Assay Description:Human recombinant monoamine oxidase proteins MAO-A and MAO-B were purchased from Sigma Aldrich. MAOs catalyze the oxidative deamination of 1, 2 and 3...
Ligand InfoPC cidPC sid
In DepthDetails US Patent
TargetLysine-specific histone demethylase 1A(Homo sapiens (Human))
Oryzon Genomics
US Patent
LigandPNGBDBM153440(US8993808, 38)
Affinity DataIC50:  190nM. Assay description: The compounds of the invention can be tested for their ability to inhibit LSD1. The ability of the compounds of the invention to inhibit LSD1 can be ...
Ligand InfoPC cidPC sid
In DepthDetails US Patent
TargetAmine oxidase [flavin-containing] B(Homo sapiens (Human))
Oryzon Genomics
US Patent
LigandPNGBDBM153440(US8993808, 38)
Affinity DataIC50:  1.82E+4nMpH: 7.5Assay Description:Human recombinant monoamine oxidase proteins MAO-A and MAO-B were purchased from Sigma Aldrich. MAOs catalyze the oxidative deamination of 1, 2 and 3...
Ligand InfoPC cidPC sid
In DepthDetails US Patent