BDBM153708 3-Phenyl-2-(4-((4-(tetrahydrofuran-2-carbonyl)piperazin-1-yl)methyl)phenyl)-1,6-naphthyridin-5(6H)-one (7g)
SMILES O=C(C1CCCO1)N1CCN(Cc2ccc(cc2)-c2nc3cc[nH]c(=O)c3cc2-c2ccccc2)CC1
InChI Key
Data  1 IC50  1 Kd
  Tab Delimited (TSV)   2D SDfile   Computed 3D by Vconf -m prep SDfile
Find this compound or compounds like it in BindingDB:
Activity Spreadsheet -- Enzyme Inhibition Constant Data from BindingDB
Found 2 hits for monomerid = 153708
TargetRAC-alpha serine/threonine-protein kinase [E49C,C296S,C310S,C344S](Homo sapiens (Human))
Technische Universit??????T Dortmund
LigandPNGBDBM153708(3-Phenyl-2-(4-((4-(tetrahydrofuran-2-carbonyl)pipe...)
Affinity DataKd:  8.00E+3nMpH: 7.4Assay Description:Labeled Akt1 was diluted to 200 nM in the measurement buffer consisting of 50 mMHEPES pH 7.4, 200 mM NaCl, and 0.01% Triton-X 100. Dilution series of...
Ligand InfoPC cidPC sid
In DepthDetails ArticlePubMed
TargetRAC-alpha serine/threonine-protein kinase [E49C,C296S,C310S,C344S](Homo sapiens (Human))
Technische Universit??????T Dortmund
LigandPNGBDBM153708(3-Phenyl-2-(4-((4-(tetrahydrofuran-2-carbonyl)pipe...)
Affinity DataIC50:  2.10E+3nM. Assay description: IC50 determinations for activated Akt1 were measured with the KinEASE assay (Cisbio) according to the manufacturer’s instructions. The kinases A...
Ligand InfoPC cidPC sid
In DepthDetails ArticlePubMed