BDBM153755 ROCHE screening, 77
SMILES COc1cc[nH]c1\C=C1/C(=O)Nc2ccc(c(N3CC[C@H](O)C3)c12)[N+]([O-])=O
InChI Key
Data  1 IC50
  Tab Delimited (TSV)   2D SDfile   Computed 3D by Vconf -m prep SDfile
Find this compound or compounds like it in BindingDB:
Activity Spreadsheet -- Enzyme Inhibition Constant Data from BindingDB
Found 1 hit for monomerid = 153755
TargetSerine/threonine-protein kinase TBK1(Homo sapiens (Human))
Technical University Of Dortmund
LigandPNGBDBM153755(ROCHE screening, 77)
Affinity DataIC50:  3nM. Assay description: IC50 determinations for TBK1 were performed with the KinEASE-STK assay from Cisbio according to the manufacturer's instructions. A biotinylated s...
In DepthDetails ArticlePubMed