BDBM15398 3-(5-chloro-2,4-dihydroxyphenyl)-N-{[3-(trifluoromethyl)phenyl]methyl}-1H-pyrazole-4-carboxamide::3-(5-chloro-2,4-dihydroxyphenyl)-pyrazole-4-carboxamide 14m
SMILES Oc1cc(O)c(cc1Cl)-c1n[nH]cc1C(=O)NCc1cccc(c1)C(F)(F)F
InChI Key InChIKey=MCELZAVXRGEPDE-UHFFFAOYSA-N
Data  1 IC50
  Tab Delimited (TSV)   2D SDfile   Computed 3D by Vconf -m prep SDfile
Find this compound or compounds like it in BindingDB:
Activity Spreadsheet -- Enzyme Inhibition Constant Data from BindingDB
Found 1 hit for monomerid = 15398
TargetHeat shock protein HSP 90-beta(Homo sapiens (Human))
Vernalis (R&D)
LigandPNGBDBM15398(3-(5-chloro-2,4-dihydroxyphenyl)-N-{[3-(trifluorom...)
Affinity DataIC50:  5.40E+3nMpH: 7.4 T: 2°C. Assay description: The assay is based upon displacement of a fluorescently labeled molecule, which binds specifically to the ATP-binding site of full-length human Hsp90...
In DepthDetails ArticlePubMed