BDBM153991 US8999981, F47
SMILES C.C[C@H]1CN(CC2CCOCC2)CCN1C(=O)N1Cc2c(NC(=O)c3cccc(F)c3)n[nH]c2C1(C)C
InChI Key
Data  1 KI
  Tab Delimited (TSV)   2D SDfile   Computed 3D by Vconf -m prep SDfile
Find this compound or compounds like it in BindingDB:
Activity Spreadsheet -- Enzyme Inhibition Constant Data from BindingDB
Found 1 hit for monomerid = 153991
TargetProtein kinase C beta type(Homo sapiens (Human))
Pfizer
US Patent
LigandPNGBDBM153991(US8999981, F47)
Affinity DataKi: <10nM ΔG°: <-11.1kcal/molepH: 7.4 T: 2°C. Assay description: Protein Kinase C beta 2 (PKC beta II) catalyzes the production of ADP from ATP that accompanies the phosphoryl transfer to the PKC Pseudosubstrate pe...
In DepthDetails US Patent