BDBM154186 US9012443, 195
SMILES COc1cc(ccc1-c1nccc2cc(ccc12)S(=O)(=O)Nc1ncns1)C(F)(F)F
InChI Key InChIKey=JXNFMVUGEKAWQP-UHFFFAOYSA-N
Data  3 IC50
  Tab Delimited (TSV)   2D SDfile   Computed 3D by Vconf -m prep SDfile
Find this compound or compounds like it in BindingDB:
Activity Spreadsheet -- Enzyme Inhibition Constant Data from BindingDB
Found 3 hits for monomerid = 154186
TargetSodium channel protein type 9 subunit alpha(Homo sapiens (Human))
Amgen
US Patent
LigandPNGBDBM154186(US9012443, 195)
Affinity DataIC50:  10nM. Assay description: 293 Cells stably transfected with either Nav 1.7 or Nav 1.5 were recorded in population patch-clamp mode with the IonWorks Quattro automated electrop...
In DepthDetails US Patent
TargetSodium channel protein type 5 subunit alpha(Homo sapiens (Human))
Amgen
US Patent
LigandPNGBDBM154186(US9012443, 195)
Affinity DataIC50: >3.00E+4nM. Assay description: 293 cells stably transfected with Nav 1.5 were recorded in whole cell voltage clamp mode with the PatchXpress automated electrophysiology system acco...
In DepthDetails US Patent
TargetSodium channel protein type 9 subunit alpha(Homo sapiens (Human))
Amgen
US Patent
LigandPNGBDBM154186(US9012443, 195)
Affinity DataIC50:  134nM. Assay description: 293 cells stably transfected with human Nav1.7 were recorded in whole cell voltage clamp mode with the PatchXpress automated electrophysiology system...
In DepthDetails US Patent