BDBM15427 5-[4-(3-chlorophenyl)-2-(thiophen-2-yl)-1H-imidazol-5-yl]-1,3-dimethyl-2,3-dihydro-1H-1,3-benzodiazol-2-one::benzimidazolone 12m
SMILES Cn1c2ccc(cc2n(C)c1=O)-c1nc([nH]c1-c1cccc(Cl)c1)-c1cccs1
InChI Key InChIKey=ZMDUZLVDUGTHKN-UHFFFAOYSA-N
Data  1 IC50
  Tab Delimited (TSV)   2D SDfile   Computed 3D by Vconf -m prep SDfile
Find this compound or compounds like it in BindingDB:
Activity Spreadsheet -- Enzyme Inhibition Constant Data from BindingDB
Found 1 hit for monomerid = 15427
TargetMitogen-activated protein kinase 14(Homo sapiens (Human))
Pfizer
LigandPNGBDBM15427(5-[4-(3-chlorophenyl)-2-(thiophen-2-yl)-1H-imidazo...)
Affinity DataIC50:  380nMpH: 7.2 T: 2°C. Assay description: The IC50s were determined by incubating each test compound with activated p38-alpha in a 96-well plate that had been pre-treated with ATF-2-GST to al...
In DepthDetails ArticlePubMed