BDBM154522 24F1 (17e)
SMILES CN(C)CCOc1ccc(cc1)-c1c(sc2cc(O)ccc12)-c1ccc(O)cc1
InChI Key InChIKey=XUGSVXDTDCXFMC-UHFFFAOYSA-N
Data  3 IC50
  Tab Delimited (TSV)   2D SDfile   Computed 3D by Vconf -m prep SDfile
Find this compound or compounds like it in BindingDB:
Activity Spreadsheet -- Enzyme Inhibition Constant Data from BindingDB
Found 3 hits for monomerid = 154522
TargetPhospholipase D1(Homo sapiens (Human))
Vanderbilt University
LigandPNGBDBM154522(24F1 (17e))
Affinity DataIC50:  1.97E+4nMpH: 7.5Assay Description:Briefly, PLD activity was measured as the release of free [3H]-choline from [choline-methyl-3H] dipalmitoylphosphatidylcholine ([3H]-DPPC). 3−5...
In DepthDetails ArticlePubMed
TargetPhospholipase(Pseudomonas aeruginosa (g-Proteobacteria))
Vanderbilt University
LigandPNGBDBM154522(24F1 (17e))
Affinity DataIC50:  1.06E+4nMpH: 7.5Assay Description:In brief, 6 nM purified PldA was incubated with liposomes containing 90 μM 1,2-dioleoyl-sn-glycero-3-phospho-(1′-rac-glycerol), 10 μM...
In DepthDetails ArticlePubMed
TargetPhospholipase D2(Homo sapiens (Human))
Vanderbilt University
LigandPNGBDBM154522(24F1 (17e))
Affinity DataIC50:  5.80E+3nMpH: 7.5Assay Description:Briefly, PLD activity was measured as the release of free [3H]-choline from [choline-methyl-3H] dipalmitoylphosphatidylcholine ([3H]-DPPC). 3−5...
In DepthDetails ArticlePubMed