BDBM154532 2-(3-chlorophenyl)-6-(4-ethylphenyl)-1-(4-methylbenzenesulfonyl)-1,2,5,6-tetrahydropyridine-3-carboxylic acid (J8)
SMILES CCc1ccc(cc1)C1CC=C(C(N1S(=O)(=O)c1ccc(C)cc1)c1cccc(Cl)c1)C(O)=O
InChI Key InChIKey=JISCXURYGLVIFN-UHFFFAOYSA-N
Data  1 IC50
  Tab Delimited (TSV)   2D SDfile   Computed 3D by Vconf -m prep SDfile
Find this compound or compounds like it in BindingDB:
Activity Spreadsheet -- Enzyme Inhibition Constant Data from BindingDB
Found 1 hit for monomerid = 154532
TargetPlatelet-activating factor acetylhydrolase IB subunit alpha2(Mus musculus (Mouse))
University Of California Berkeley
LigandPNGBDBM154532(2-(3-chlorophenyl)-6-(4-ethylphenyl)-1-(4-methylbe...)
Affinity DataIC50:  9.40E+3nMpH: 7.5Assay Description:For in vitro experiments, proteomes were diluted to 1 mg/mL in PBS (pH 7.5, 50 μL total reaction volume), doped with 1 μM recombinant PAFAH...
In DepthDetails ArticlePubMed