BDBM154536 2-(4-tert-butylphenyl)-1-(4-methylbenzenesulfonyl)-6-(4-methylphenyl)-1,2,5,6-tetrahydropyridine-3-carboxylic acid (P11)
SMILES Cc1ccc(cc1)C1CC=C(C(N1S(=O)(=O)c1ccc(C)cc1)c1ccc(cc1)C(C)(C)C)C(O)=O
InChI Key InChIKey=KUBDPRSHRVANQQ-UHFFFAOYSA-N
Data  1 IC50
  Tab Delimited (TSV)   2D SDfile   Computed 3D by Vconf -m prep SDfile
Find this compound or compounds like it in BindingDB:
Activity Spreadsheet -- Enzyme Inhibition Constant Data from BindingDB
Found 1 hit for monomerid = 154536
TargetPlatelet-activating factor acetylhydrolase IB subunit alpha2(Mus musculus (Mouse))
University Of California Berkeley
LigandPNGBDBM154536(2-(4-tert-butylphenyl)-1-(4-methylbenzenesulfonyl)...)
Affinity DataIC50:  800nMpH: 7.5Assay Description:For in vitro experiments, proteomes were diluted to 1 mg/mL in PBS (pH 7.5, 50 μL total reaction volume), doped with 1 μM recombinant PAFAH...
In DepthDetails ArticlePubMed