BDBM154590 US8999957, Column 141, Compound 6::US8999957, Table 1, Compound 14
SMILES CC(C)Oc1ccc(cn1)-c1n[nH]c2ccc(cc12)C(=O)N[C@@H]1CCCN(Cc2ccccc2F)C1
InChI Key
Data  4 IC50  2 Kd
  Tab Delimited (TSV)   2D SDfile   Computed 3D by Vconf -m prep SDfile
Find this compound or compounds like it in BindingDB:
Activity Spreadsheet -- Enzyme Inhibition Constant Data from BindingDB
Found 6 hits for monomerid = 154590
TargetMitogen-activated protein kinase 3(Mus musculus (Mouse))
Merck Sharp & Dohme
US Patent
LigandPNGBDBM154590(US8999957, Column 141, Compound 6 | US8999957, Tab...)
Affinity DataKd:  2nM. Assay description: The SAR (Structure Activity Relationship) for ERK ligands covered by this invention was interrogated using the TdF (Temperature Dependence Fluorescen...
In DepthDetails US Patent
TargetMitogen-activated protein kinase 1(Mus musculus (Mouse))
Merck Sharp & Dohme
US Patent
LigandPNGBDBM154590(US8999957, Column 141, Compound 6 | US8999957, Tab...)
Affinity DataIC50:  124nMpH: 7.2 T: 2°C. Assay description: Activity of compounds against inactive ERK2 was tested in a coupled MEK1/ERK2 IMAP assay as follows: Compounds were diluted to 25x final test concent...
In DepthDetails US Patent
TargetMitogen-activated protein kinase 1(Mus musculus (Mouse))
Merck Sharp & Dohme
US Patent
LigandPNGBDBM154590(US8999957, Column 141, Compound 6 | US8999957, Tab...)
Affinity DataIC50:  77.9nM. Assay description: Condition 1: Activated ERK2 activity was also determined in the IMAP assay format using the procedure outlined above. 1 μl of 25× compound was a...
In DepthDetails US Patent
TargetMitogen-activated protein kinase 3(Mus musculus (Mouse))
Merck Sharp & Dohme
US Patent
LigandPNGBDBM154590(US8999957, Column 141, Compound 6 | US8999957, Tab...)
Affinity DataKd:  2nM. Assay description: The SAR (Structure Activity Relationship) for ERK ligands covered by this invention was interrogated using the TdF (Temperature Dependence Fluorescen...
In DepthDetails US Patent
TargetMitogen-activated protein kinase 1(Mus musculus (Mouse))
Merck Sharp & Dohme
US Patent
LigandPNGBDBM154590(US8999957, Column 141, Compound 6 | US8999957, Tab...)
Affinity DataIC50:  124nMpH: 7.2 T: 2°C. Assay description: Activity of compounds against inactive ERK2 was tested in a coupled MEK1/ERK2 IMAP assay as follows: Compounds were diluted to 25x final test concent...
In DepthDetails US Patent
TargetMitogen-activated protein kinase 1(Mus musculus (Mouse))
Merck Sharp & Dohme
US Patent
LigandPNGBDBM154590(US8999957, Column 141, Compound 6 | US8999957, Tab...)
Affinity DataIC50:  77.9nM. Assay description: Condition 1: Activated ERK2 activity was also determined in the IMAP assay format using the procedure outlined above. 1 μl of 25× compound was a...
In DepthDetails US Patent