BDBM154665 US8999957, Table 2, Compound 2
SMILES Fc1ccccc1CN1CCC[C@H](C1)NC(=O)c1ccc2[nH]nc(-c3ccnc(c3)C3CC3)c2c1
InChI Key
Data  1 IC50  1 Kd
  Tab Delimited (TSV)   2D SDfile   Computed 3D by Vconf -m prep SDfile
Find this compound or compounds like it in BindingDB:
Activity Spreadsheet -- Enzyme Inhibition Constant Data from BindingDB
Found 2 hits for monomerid = 154665
TargetMitogen-activated protein kinase 1(Mus musculus (Mouse))
Merck Sharp & Dohme
US Patent
LigandPNGBDBM154665(US8999957, Table 2, Compound 2)
Affinity DataIC50:  33.2nM. Assay description: Condition 1: Activated ERK2 activity was also determined in the IMAP assay format using the procedure outlined above. 1 μl of 25× compound was a...
In DepthDetails US Patent
TargetMitogen-activated protein kinase 3(Mus musculus (Mouse))
Merck Sharp & Dohme
US Patent
LigandPNGBDBM154665(US8999957, Table 2, Compound 2)
Affinity DataKd:  0.400nM. Assay description: The SAR (Structure Activity Relationship) for ERK ligands covered by this invention was interrogated using the TdF (Temperature Dependence Fluorescen...
In DepthDetails US Patent