BDBM154874 US8999957, Table 3, Compound 147
SMILES CNC(=S)NNC(=O)[C@@H]1CC[C@H](CN1Cc1c(F)cccc1OC)NC(=O)c1ccc2[nH]nc(-c3ccnc(C)c3)c2c1
InChI Key
Data  1 IC50
  Tab Delimited (TSV)   2D SDfile   Computed 3D by Vconf -m prep SDfile
Find this compound or compounds like it in BindingDB:
Activity Spreadsheet -- Enzyme Inhibition Constant Data from BindingDB
Found 1 hit for monomerid = 154874
TargetMitogen-activated protein kinase 1(Mus musculus (Mouse))
Merck Sharp & Dohme
US Patent
LigandPNGBDBM154874(US8999957, Table 3, Compound 147)
Affinity DataIC50:  1nM. Assay description: Condition 1: Activated ERK2 activity was also determined in the IMAP assay format using the procedure outlined above. 1 μl of 25× compound was a...
In DepthDetails US Patent