BDBM155235 US9006232, 2.203
SMILES Cn1c(OC[C@H]2CCCN2c2ccc(F)cc2)nc(cc1=O)-c1ccncc1F
InChI Key InChIKey=GQLOOXKUISSHOB-MRXNPFEDSA-N
Data  1 IC50
  Tab Delimited (TSV)   2D SDfile   Computed 3D by Vconf -m prep SDfile
Find this compound or compounds like it in BindingDB:
Activity Spreadsheet -- Enzyme Inhibition Constant Data from BindingDB
Found 1 hit for monomerid = 155235
TargetGlycogen synthase kinase-3 beta(Bos taurus (cattle))
Mitsubishi Tanabe Pharma
US Patent
LigandPNGBDBM155235(US9006232, 2.203)
Affinity DataIC50:  43.1nMpH: 6.5 T: 2°C. Assay description: A mixture containing 100 mM MES-sodium hydroxide (pH 6.5), 1 mM magnesium acetate, 0.5 mM EGTA, 5 mM, .beta.-mercaptoethanol, 0.02% Tween 20, 10% gly...
In DepthDetails US Patent