BDBM155341 US9006246, 51(48)::US9636330, 51(48)
SMILES Cc1cc(CC(=O)N2CCc3c(C2)n(Cc2csc(Cl)c2)c2ncccc32)ccc1C(O)=O
InChI Key InChIKey=SXZOHQHVPHQMFK-UHFFFAOYSA-N
Data  2 IC50
  Tab Delimited (TSV)   2D SDfile   Computed 3D by Vconf -m prep SDfile
Find this compound or compounds like it in BindingDB:
Activity Spreadsheet -- Enzyme Inhibition Constant Data from BindingDB
Found 2 hits for monomerid = 155341
TargetEctonucleotide pyrophosphatase/phosphodiesterase family member 2(Homo sapiens (Human))
Ono Pharmaceutical
US Patent
LigandPNGBDBM155341(US9006246, 51(48) | US9636330, 51(48))
Affinity DataIC50:  7.80nM. Assay description: 10 μL of a test compound solution (10% dimethyl sulfoxide) at each concentration and 40 μL of a 5 μg/mL human ENPP2 solution (buffer A...
Ligand InfoPC cidPC sid
In DepthDetails US Patent
TargetEctonucleotide pyrophosphatase/phosphodiesterase family member 2(Homo sapiens (Human))
Ono Pharmaceutical
US Patent
LigandPNGBDBM155341(US9006246, 51(48) | US9636330, 51(48))
Affinity DataIC50:  7.80nMpH: 9.0Assay Description:10 μL of a test compound solution (10% dimethyl sulfoxide) at each concentration and 40 μL of a 5 μg/mL human ENPP2 solution (buffer A...
Ligand InfoPC cidPC sid
In DepthDetails US Patent