BDBM155362 US10383871, Example 8::US10918640, Example 8::US9006269, 8
SMILES COCCOc1cccc(c1)-c1ccc(OC2CN(C2)C(=O)Nc2cccnc2)nc1
InChI Key InChIKey=KUYLWYGIJNQGJB-UHFFFAOYSA-N
Data  3 IC50
  Tab Delimited (TSV)   2D SDfile   Computed 3D by Vconf -m prep SDfile
Find this compound or compounds like it in BindingDB:
Activity Spreadsheet -- Enzyme Inhibition Constant Data from BindingDB
Found 3 hits for monomerid = 155362
TargetFatty-acid amide hydrolase 1(Homo sapiens (Human))
Vernalis (R&D)
US Patent
LigandPNGBDBM155362(US10383871, Example 8 | US10918640, Example 8 | US...)
Affinity DataIC50:  18nMpH: 8.2 T: 2°C. Assay description: Human FAAH 1 activity was determined by measuring the liberation of the highly fluorescent 7-amino, 4-methyl Coumarin (AMC) generated during hydrolys...
Ligand InfoPC cidPC sid
In DepthDetails US Patent
TargetFatty-acid amide hydrolase 1(Homo sapiens (Human))
Vernalis (R&D)
US Patent
LigandPNGBDBM155362(US10383871, Example 8 | US10918640, Example 8 | US...)
Affinity DataIC50:  18nM. Assay description: Human FAAH 1 activity was determined by measuring the liberation of the highly fluorescent 7-amino, 4-methyl Coumarin (AMC) generated during hydrolys...
Ligand InfoPC cidPC sid
In DepthDetails US Patent
TargetFatty-acid amide hydrolase 1(Homo sapiens (Human))
Vernalis (R&D)
US Patent
LigandPNGBDBM155362(US10383871, Example 8 | US10918640, Example 8 | US...)
Affinity DataIC50:  18nM. Assay description: Human FAAH 1 activity was determined by measuring the liberation of the highly fluorescent 7-amino, 4-methyl Coumarin (AMC) generated during hydrolys...
Ligand InfoPC cidPC sid
In DepthDetails US Patent