BDBM155395 US9006283, 5
SMILES COc1ccccc1NC(=O)C(=O)N1N=C(CC(C)C)CC1(O)C(F)(F)F
InChI Key InChIKey=HYCRMNNPAJWJGN-UHFFFAOYSA-N
Data  1 IC50
  Tab Delimited (TSV)   2D SDfile   Computed 3D by Vconf -m prep SDfile
Find this compound or compounds like it in BindingDB:
Activity Spreadsheet -- Enzyme Inhibition Constant Data from BindingDB
Found 1 hit for monomerid = 155395
TargetAmyloid-beta precursor protein(Rattus norvegicus (Rat))
Acumen Pharmaceuticals
US Patent
LigandPNGBDBM155395(US9006283, 5)
Affinity DataIC50:  3.20E+3nMpH: 8.0 T: 2°C. Assay description: In this assay, assembly of Abeta 1-42 oligomer formation is monitored by FRET using N-terminal conjugates of fluorescein-Abeta 1-42 as both the donor...
In DepthDetails US Patent