BDBM155530 US9012461, 6
SMILES CN1CCN(CC1)c1cccc(Nc2ncc(c(CCc3cccc(c3)C(N)=O)n2)C(F)(F)F)c1
InChI Key InChIKey=YHTNFBOBCGNQHU-UHFFFAOYSA-N
Data  2 IC50  1 Kd
  Tab Delimited (TSV)   2D SDfile   Computed 3D by Vconf -m prep SDfile
Find this compound or compounds like it in BindingDB:
Activity Spreadsheet -- Enzyme Inhibition Constant Data from BindingDB
Found 3 hits for monomerid = 155530
TargetFocal adhesion kinase 1(Homo sapiens (Human))
Cancer Therapeutics Crc
US Patent
LigandPNGBDBM155530(US9012461, 6)
Affinity DataIC50:  4.20nMpH: 7.4Assay Description:A biotin labeled peptide is used as substrate (amino acid sequence: Biotin-Glu-Gly-Pro-Trp-Leu-Glu-Glu-Glu-Glu-Glu-Ala-Tyr-Gly-Trp-Met-Asp-Phe-NH2)1S...
In DepthDetails US Patent
TargetFocal adhesion kinase 1(Homo sapiens (Human))
Cancer Therapeutics Crc
US Patent
LigandPNGBDBM155530(US9012461, 6)
Affinity DataIC50:  52nMpH: 7.0Assay Description:Compounds of the invention may be tested for in vitro activity in the following assay: A biotin labeled peptide is used as substrate (amino acid sequ...
In DepthDetails US Patent
TargetFocal adhesion kinase 1(Homo sapiens (Human))
Cancer Therapeutics Crc
US Patent
LigandPNGBDBM155530(US9012461, 6)
Affinity DataKd:  6.30nMpH: 7.4 T: 2°C. Assay description: Binding parameters of compounds were determined using a Biacore S51 sensor. An anti-GST antibody was immobilized onto a CM5 chip by primary amine-cou...
In DepthDetails US Patent